Target
Toll-like receptor 2
Ligand
BDBM50358558
Substrate
Meas. Tech.
ChEMBL_790131 (CHEMBL1926410)
EC50
0.26±n/a nM
Citation
 Agnihotri, GCrall, BMLewis, TCDay, TPBalakrishna, RWarshakoon, HJMalladi, SSDavid, SA Structure-activity relationships in toll-like receptor 2-agonists leading to simplified monoacyl lipopeptides. J Med Chem 54:8148-60 (2011)  
Target
Name:
Toll-like receptor 2
Synonyms:
TIL4 TLR2_HUMAN Toll-like receptor 2 (TLR2)
Type:
Protein
Mol. Mass.:
89837.58
Organism:
Homo sapiens (Human)
Description:
O60603
Residue:
784
  
Inhibitor
Name:
BDBM50358558
Synonyms:
CHEMBL1923557
Type:
Small organic molecule
Emp. Form.:
C42H80N2O8Se
Mol. Mass.:
820.05
SMILES:
CCCCCCCCCCCCCCCC(=O)OC[C@H](C[Se]C[C@H](N)C(=O)N[C@@H](CO)C(=O)OC)OC(=O)CCCCCCCCCCCCCCC
: