Target
C-X-C chemokine receptor type 3
Ligand
BDBM50358632
Substrate
Meas. Tech.
ChEMBL_789428 (CHEMBL1924404)
IC50
2.9±n/a nM
Citation
 Kim, SHAnilkumar, GNZawacki, LGZeng, QYang, DYShao, YDong, GXu, XYu, WJiang, YJenh, CHHall, JWCarroll, CDHobbs, DWBaldwin, JJMcGuinness, BFRosenblum, SBKozlowski, JAShankar, BBShih, NY III. Identification of novel CXCR3 chemokine receptor antagonists with a pyrazinyl-piperazinyl-piperidine scaffold. Bioorg Med Chem Lett 21:6982-6 (2011)  
Target
Name:
C-X-C chemokine receptor type 3
Synonyms:
AAO92295.1 C-X-C chemokine receptor type 3 (CXCR3) CXCR3 CXCR3_HUMAN chemokine (C-X-C motif) receptor 3
Type:
Enzyme Catalytic Domain
Mol. Mass.:
40665.65
Organism:
Homo sapiens (Human)
Description:
Residue:
368
  
Inhibitor
Name:
BDBM50358632
Synonyms:
CHEMBL1921881
Type:
Small organic molecule
Emp. Form.:
C25H34Cl2N8O3
Mol. Mass.:
565.495
SMILES:
CC[C@H]1CN(CCN1C1CCN(CC1)C(=O)c1ccc(Cl)nc1N)c1ncc(nc1Cl)C(=O)NC[C@@H](C)O
: