Target
5-hydroxytryptamine receptor 6
Ligand
BDBM50358776
Substrate
Meas. Tech.
ChEMBL_789778 (CHEMBL1924994)
Ki
1.4±n/a nM
Citation
 Ivachtchenko, AVGolovina, ESKadieva, MGKysil, VMMitkin, ODTkachenko, SEOkun, IM Synthesis and structure-activity relationship (SAR) of (5,7-disubstituted 3-phenylsulfonyl-pyrazolo[1,5-a]pyrimidin-2-yl)-methylamines as potent serotonin 5-HT(6) receptor (5-HT(6)R) antagonists. J Med Chem 54:8161-73 (2011)  
Target
Name:
5-hydroxytryptamine receptor 6
Synonyms:
5-HT-6 5-hydroxytryptamine receptor 6 (5-HT-6) 5-hydroxytryptamine receptor 6 (5HT6) HTR6 Serotonin 6 (5-HT6) receptor | Serotonin Receptor 6
Type:
G Protein-Coupled Receptor (GPCR)
Mol. Mass.:
46968.43
Organism:
Homo sapiens (Human)
Description:
P50406
Residue:
440
  
Inhibitor
Name:
BDBM50358776
Synonyms:
CHEMBL1922716
Type:
Small organic molecule
Emp. Form.:
C18H22FN3O2S
Mol. Mass.:
363.45
SMILES:
CNc1cc(ccc1S(=O)(=O)c1cccc(F)c1)N1CCCNCC1
: