Target
Beta-secretase 2
Ligand
BDBM50358931
Substrate
Meas. Tech.
ChEMBL_790909 (CHEMBL1926457)
Ki
2067±n/a nM
Citation
 Al-Tel, THSemreen, MHAl-Qawasmeh, RASchmidt, MFEl-Awadi, RArdah, MZaarour, RRao, SNEl-Agnaf, O Design, synthesis, and qualitative structure-activity evaluations of novelß-secretase inhibitors as potential Alzheimer's drug leads. J Med Chem 54:8373-85 (2011)  
Target
Name:
Beta-secretase 2
Synonyms:
AEPLC ASP1 Asp 1 Aspartyl protease 1 BACE2_HUMAN Beta-secretase (BACE) Beta-secretase 2 (BACE-2) Beta-site APP-cleaving enzyme 2 Memapsin-1 beta-Secretase (BACE-2)
Type:
Protein
Mol. Mass.:
56171.20
Organism:
Homo sapiens (Human)
Description:
Q9Y5Z0
Residue:
518
  
Inhibitor
Name:
BDBM50358931
Synonyms:
CHEMBL1923700
Type:
Small organic molecule
Emp. Form.:
C24H24N4O3S
Mol. Mass.:
448.537
SMILES:
C[C@H](NC(=O)c1cc(cc(c1)-c1nc2ccccc2[nH]1)N(C)S(C)(=O)=O)c1ccccc1
: