Target
Androgen receptor
Ligand
BDBM18860
Substrate
Meas. Tech.
ChEMBL_791027 (CHEMBL1925688)
IC50
>50000±n/a nM
Citation
 Lack, NAAxerio-Cilies, PTavassoli, PHan, FQChan, KHFeau, CLeBlanc, EGuns, ETGuy, RKRennie, PSCherkasov, A Targeting the binding function 3 (BF3) site of the human androgen receptor through virtual screening. J Med Chem 54:8563-73 (2011)  
Target
Name:
Androgen receptor
Synonyms:
ANDR_HUMAN Androgen Receptor Androgen receptor/Baculoviral IAP repeat-containing protein 2 Dihydrotestosterone receptor Nuclear receptor subfamily 3 group C member 4
Type:
Receptor
Mol. Mass.:
99185.27
Organism:
Homo sapiens (Human)
Description:
CHO cells were stably transfected with human AR gene.
Residue:
920
  
Inhibitor
Name:
BDBM18860
Synonyms:
(2R)-2-amino-3-[4-(4-hydroxy-3-iodophenoxy)-3,5-diiodophenyl]propanoic acid 3,5,3'-triiodo-L-thyronine (T3) Triiodothyronine US10544075, Compound T3 liothyronine | triothyrone
Type:
Hormone
Emp. Form.:
C15H12I3NO4
Mol. Mass.:
650.9735
SMILES:
N[C@@H](Cc1cc(I)c(Oc2ccc(O)c(I)c2)c(I)c1)C(O)=O
: