Target
C-C chemokine receptor type 2
Ligand
BDBM50359022
Substrate
Meas. Tech.
ChEMBL_791034 (CHEMBL1925695)
Ki
8±n/a nM
Citation
 Wang, GZHaile, PADaniel, TBelot, BViet, AQGoodman, KBSha, DDowdell, SEVarga, NHong, XChakravorty, SWebb, CCornejo, COlzinski, ABernard, REvans, CEmmons, ABriand, JChung, CWQuek, RLee, DGough, PJSehon, CA CCR2 receptor antagonists: optimization of biaryl sulfonamides to increase activity in whole blood. Bioorg Med Chem Lett 21:7291-4 (2011)  
Target
Name:
C-C chemokine receptor type 2
Synonyms:
C-C chemokine receptor type 2 (CCR2) CCR2_HUMAN Chemoattractant Cytokine Receptor 2 (CCR2) Monocyte chemotactic protein-1 (MCP-1)
Type:
Enzyme
Mol. Mass.:
41932.32
Organism:
Homo sapiens (Human)
Description:
P41597
Residue:
374
  
Inhibitor
Name:
BDBM50359022
Synonyms:
CHEMBL1924023
Type:
Small organic molecule
Emp. Form.:
C27H26Cl2F3N3O4S
Mol. Mass.:
616.479
SMILES:
Cc1cc(ccc1Oc1ccc(Cl)cc1NS(=O)(=O)c1ccc(Cl)c(c1)C(F)(F)F)C(=O)NCCN1CCCC1
: