Target
Arachidonate 5-lipoxygenase-activating protein
Ligand
BDBM50006805
Substrate
Meas. Tech.
ChEMBL_789604 (CHEMBL1924645)
IC50
5.7±n/a nM
Citation
 Stock, NSBain, GZunic, JLi, YZiff, JRoppe, JSantini, ADarlington, JProdanovich, PKing, CDBaccei, CLee, CRong, HChapman, CBroadhead, ALorrain, DCorrea, LHutchinson, JHEvans, JFPrasit, P 5-Lipoxygenase-activating protein (FLAP) inhibitors. Part 4: development of 3-[3-tert-butylsulfanyl-1-[4-(6-ethoxypyridin-3-yl)benzyl]-5-(5-methylpyridin-2-ylmethoxy)-1H-indol-2-yl]-2,2-dimethylpropionic acid (AM803), a potent, oral, once daily FLAP inhibitor. J Med Chem 54:8013-29 (2011)  
Target
Name:
Arachidonate 5-lipoxygenase-activating protein
Synonyms:
5-lipoxygenase activating protein 5-lipoxygenase/FLAP ALOX5AP MK-886-binding protein
Type:
Enzyme
Mol. Mass.:
18159.90
Organism:
Homo sapiens (Human)
Description:
P20292
Residue:
161
  
Inhibitor
Name:
BDBM50006805
Synonyms:
3-(1-(4-chlorobenzyl)-3-(tert-butylthio)-5-isopropyl-1H-indol-2-yl)-2,2-dimethylpropanoic acid 3-[1-(4-chlorobenzyl)-3-t-butyl-thio-5-isopropylindol-2-yl]-2,2-dimethylpropanoic acid CHEMBL29097 MK886 | cid_3651377
Type:
Small organic molecule
Emp. Form.:
C27H34ClNO2S
Mol. Mass.:
472.082
SMILES:
CC(C)c1ccc2n(Cc3ccc(Cl)cc3)c(CC(C)(C)C(O)=O)c(SC(C)(C)C)c2c1
: