Target
Insulin receptor
Ligand
BDBM50359161
Substrate
Meas. Tech.
ChEMBL_789802 (CHEMBL1925063)
IC50
>1000±n/a nM
Citation
 Tripathy, RMcHugh, RJGhose, AKOtt, GRAngeles, TSAlbom, MSHuang, ZAimone, LDCheng, MDorsey, BD Pyrazolone-based anaplastic lymphoma kinase (ALK) inhibitors: control of selectivity by a benzyloxy group. Bioorg Med Chem Lett 21:7261-4 (2011)  
Target
Name:
Insulin receptor
Synonyms:
INSR INSR_HUMAN Insulin receptor beta subunit
Type:
Receptor Tyrosine Kinase
Mol. Mass.:
156322.60
Organism:
Homo sapiens (Human)
Description:
P06213
Residue:
1382
  
Inhibitor
Name:
BDBM50359161
Synonyms:
CHEMBL1922981
Type:
Small organic molecule
Emp. Form.:
C23H17FN4O2S
Mol. Mass.:
432.47
SMILES:
Cn1cc(\C=C2/C(=O)NN=C2c2nccs2)c2c(OCc3cccc(F)c3)cccc12
: