Target
ALK tyrosine kinase receptor
Ligand
BDBM50359142
Substrate
Meas. Tech.
ChEMBL_789799 (CHEMBL1925015)
IC50
158±n/a nM
Citation
 Tripathy, RMcHugh, RJGhose, AKOtt, GRAngeles, TSAlbom, MSHuang, ZAimone, LDCheng, MDorsey, BD Pyrazolone-based anaplastic lymphoma kinase (ALK) inhibitors: control of selectivity by a benzyloxy group. Bioorg Med Chem Lett 21:7261-4 (2011)  
Target
Name:
ALK tyrosine kinase receptor
Synonyms:
ALK ALK_HUMAN CD_antigen: CD246
Type:
Protein
Mol. Mass.:
176453.10
Organism:
Homo sapiens (Human)
Description:
Q9UM73
Residue:
1620
  
Inhibitor
Name:
BDBM50359142
Synonyms:
CHEMBL1922962
Type:
Small organic molecule
Emp. Form.:
C22H18N6O2S
Mol. Mass.:
430.482
SMILES:
Cn1cc(C=c2c(=O)[nH][nH]\c2=c2/snnc2=C)c2c(OCc3ccccn3)cccc12
: