Target
Appetite-regulating hormone
Ligand
BDBM50359245
Substrate
Meas. Tech.
ChEMBL_790253 (CHEMBL1925646)
Ki
81±n/a nM
Citation
 Hoveyda, HRMarsault, EGagnon, RMathieu, APVézina, MLandry, AWang, ZBenakli, KBeaubien, SSaint-Louis, CBrassard, MPinault, JFOuellet, LBhat, SRamaseshan, MPeng, XFoucher, LBeauchemin, SBhérer, PVeber, DFPeterson, MLFraser, GL Optimization of the potency and pharmacokinetic properties of a macrocyclic ghrelin receptor agonist (Part I): Development of ulimorelin (TZP-101) from hit to clinic. J Med Chem 54:8305-20 (2011)  
Target
Name:
Appetite-regulating hormone
Synonyms:
GHRL Ghrelin Ghrelin-28 Growth hormone-releasing peptide Motilin-related peptide Protein M46
Type:
PROTEIN
Mol. Mass.:
12908.57
Organism:
Homo sapiens (Human)
Description:
ChEMBL_790253
Residue:
117
  
Inhibitor
Name:
BDBM50359245
Synonyms:
CHEMBL1923635
Type:
Small organic molecule
Emp. Form.:
C31H44N4O3
Mol. Mass.:
520.7061
SMILES:
CC[C@H](C)[C@@H]1NCCCc2ccccc2CCCNC(=O)[C@@H](Cc2ccccc2)NC(=O)[C@@H](C)N(C)C1=O
: