Target
Cell division protein FtsZ
Ligand
BDBM50359410
Substrate
Meas. Tech.
ChEMBL_793371 (CHEMBL1931925)
IC50
27300±n/a nM
Citation
 Mathew, BSrivastava, SRoss, LJSuling, WJWhite, ELWoolhiser, LKLenaerts, AJReynolds, RC Novel pyridopyrazine and pyrimidothiazine derivatives as FtsZ inhibitors. Bioorg Med Chem 19:7120-8 (2011)  
Target
Name:
Cell division protein FtsZ
Synonyms:
FTSZ_MYCTU | ftsZ
Type:
PROTEIN
Mol. Mass.:
38736.30
Organism:
Mycobacterium tuberculosis
Description:
ChEMBL_1470459
Residue:
379
  
Inhibitor
Name:
BDBM50359410
Synonyms:
CHEMBL1926722
Type:
Small organic molecule
Emp. Form.:
C22H24N6O2S2
Mol. Mass.:
468.595
SMILES:
CCOC(=O)Nc1cc(NCCN(C)C)c2nc(-c3cccs3)c(nc2n1)-c1cccs1
: