Target
Cytochrome b-245 heavy chain
Ligand
BDBM50359520
Substrate
Meas. Tech.
ChEMBL_792878 (CHEMBL1931063)
Ki
510±n/a nM
Citation
 Gaggini, FLaleu, BOrchard, MFioraso-Cartier, LCagnon, LHoungninou-Molango, SGradia, ADuboux, GMerlot, CHeitz, FSzyndralewiez, CPage, P Design, synthesis and biological activity of original pyrazolo-pyrido-diazepine, -pyrazine and -oxazine dione derivatives as novel dual Nox4/Nox1 inhibitors. Bioorg Med Chem 19:6989-99 (2011)  
Target
Name:
Cytochrome b-245 heavy chain
Synonyms:
CGD91-phox CYBB Cytochrome b-245, beta polypeptide [Homo sapiens] Heme-binding membrane glycoprotein gp91phox NADPH oxidase 2 (NOX2) Neutrophil cytochrome b 91 kDa polypeptide gp91-1 p22 phagocyte B-cytochrome
Type:
Enzyme
Mol. Mass.:
65355.82
Organism:
Homo sapiens (Human)
Description:
P04839
Residue:
570
  
Inhibitor
Name:
BDBM50359520
Synonyms:
CHEMBL1927158
Type:
Small organic molecule
Emp. Form.:
C23H23N5O3
Mol. Mass.:
417.4604
SMILES:
COc1ccccc1-n1[nH]c2cc(=O)n3CCCN(Cc4ccccn4)Cc3c2c1=O
: