Target
NADPH oxidase 4
Ligand
BDBM50359534
Substrate
Meas. Tech.
ChEMBL_792879 (CHEMBL1931064)
Ki
111±n/a nM
Citation
 Gaggini, FLaleu, BOrchard, MFioraso-Cartier, LCagnon, LHoungninou-Molango, SGradia, ADuboux, GMerlot, CHeitz, FSzyndralewiez, CPage, P Design, synthesis and biological activity of original pyrazolo-pyrido-diazepine, -pyrazine and -oxazine dione derivatives as novel dual Nox4/Nox1 inhibitors. Bioorg Med Chem 19:6989-99 (2011)  
Target
Name:
NADPH oxidase 4
Synonyms:
KOX-1 Kidney superoxide-producing NADPH oxidase NOX4_HUMAN Renal NAD(P)H-oxidase
Type:
PROTEIN
Mol. Mass.:
66954.54
Organism:
Homo sapiens (Human)
Description:
ChEMBL_792879
Residue:
578
  
Inhibitor
Name:
BDBM50359534
Synonyms:
CHEMBL1927155
Type:
Small organic molecule
Emp. Form.:
C21H19ClN4O3
Mol. Mass.:
410.854
SMILES:
Clc1ccccc1-n1[nH]c2cc(=O)n3CCCN(Cc4ccoc4)Cc3c2c1=O
: