Target
Mu-type opioid receptor
Ligand
BDBM50359547
Substrate
Meas. Tech.
ChEMBL_793353 (CHEMBL1931907)
IC50
0.26±n/a nM
Citation
 Fichna, JPerlikowska, RWyrebska, AGach, KPiekielna, Jdo-Rego, JCToth, GKluczyk, AJanecki, TJanecka, A Effect of 2',6'-dimethyl-L-tyrosine (Dmt) on pharmacological activity of cyclic endomorphin-2 and morphiceptin analogs. Bioorg Med Chem 19:6977-81 (2011)  
Target
Name:
Mu-type opioid receptor
Synonyms:
MOR-1 Mu-type opioid receptor (MOR) OPRM_RAT Opioid receptor B Ror-b
Type:
G Protein-Coupled Receptor (GPCR)
Mol. Mass.:
44503.11
Organism:
Rattus norvegicus (rat)
Description:
Competition binding assays were carried out using membrane preparations from transfected HN9.10 cells that constitutively expressed the mu opioid receptor.
Residue:
398
  
Inhibitor
Name:
BDBM50359547
Synonyms:
CHEMBL1927271
Type:
Small organic molecule
Emp. Form.:
C39H49N7O7
Mol. Mass.:
727.8491
SMILES:
Cc1cc(O)cc(C)c1C[C@H](N)C(=O)N[C@@H]1CCCCNC(=O)C[C@H](NC(=O)[C@H](Cc2ccccc2)NC(=O)[C@H](Cc2ccccc2)NC1=O)C(N)=O
: