Target
Prothrombin
Ligand
BDBM50359564
Substrate
Meas. Tech.
ChEMBL_792693 (CHEMBL1930520)
IC50
601000±n/a nM
Citation
 Girnys, EAPorter, VRMosberg, HI Conformationally restricted analogs of the direct thrombin inhibitor FM 19. Bioorg Med Chem 19:7425-34 (2011)  
Target
Name:
Prothrombin
Synonyms:
Activation peptide fragment 1 Coagulation factor II Prothrombin precursor Thrombin heavy chain | Thrombin light chain
Type:
Protein
Mol. Mass.:
70029.57
Organism:
Homo sapiens (Human)
Description:
P00734
Residue:
622
  
Inhibitor
Name:
BDBM50359564
Synonyms:
CHEMBL1927653
Type:
Small organic molecule
Emp. Form.:
C27H40N8O6
Mol. Mass.:
572.6565
SMILES:
[#7]-[#6@@H](-[#6]-[#6]-[#6]\[#7]=[#6](\[#7])-[#7])-[#6](=O)-[#7]-1-[#6]-[#6]-[#6]-[#6@H]-1-[#6](=O)-[#7]-1-[#6]-[#6]-[#6]-[#6@H]-1-[#6](=O)-[#7]-[#6]-[#6](=O)-[#7]-[#6@@H](-[#6]-c1ccccc1)-[#6](-[#8])=O
: