Target
Thymidylate kinase
Ligand
BDBM50223817
Substrate
Meas. Tech.
ChEMBL_793312 (CHEMBL1931815)
Ki
26500±n/a nM
Citation
 Van Poecke, SMunier-Lehmann, HHelynck, OFroeyen, MVan Calenbergh, S Synthesis and inhibitory activity of thymidine analogues targeting Mycobacterium tuberculosis thymidine monophosphate kinase. Bioorg Med Chem 19:7603-11 (2011)  
Target
Name:
Thymidylate kinase
Synonyms:
KTHY_MYCTU Thymidine monophosphate kinase tmk
Type:
PROTEIN
Mol. Mass.:
22636.29
Organism:
Mycobacterium tuberculosis
Description:
ChEMBL_208218
Residue:
214
  
Inhibitor
Name:
BDBM50223817
Synonyms:
5'-azido-5'-deoxy-alpha-D-thymidine | CHEMBL235305
Type:
Small organic molecule
Emp. Form.:
C10H13N5O4
Mol. Mass.:
267.2413
SMILES:
Cc1cn([C@@H]2C[C@H](O)[C@@H](CN=[N+]=[N-])O2)c(=O)[nH]c1=O
: