Target
Acetylcholinesterase
Ligand
BDBM50359679
Substrate
Meas. Tech.
ChEMBL_792141 (CHEMBL1930496)
IC50
>100000±n/a nM
Citation
 Heng, STieu, WHautmann, SKuan, KPedersen, DSPietsch, MGütschow, MAbell, AD New cholesterol esterase inhibitors based on rhodanine and thiazolidinedione scaffolds. Bioorg Med Chem 19:7453-63 (2011)  
Target
Name:
Acetylcholinesterase
Synonyms:
ACES_ELEEL Acetylcholinesterase (EeAChE) | ache
Type:
Enzyme
Mol. Mass.:
71812.79
Organism:
Electrophorus electricus (Electric eel)
Description:
Residue:
633
  
Inhibitor
Name:
BDBM50359679
Synonyms:
CHEMBL1929268
Type:
Small organic molecule
Emp. Form.:
C23H23N3O5S
Mol. Mass.:
453.511
SMILES:
CCCc1ccccc1NC(=O)[C@H](CO)NC(=O)c1ccc(C=C2SC(O)=NC2=O)cc1
: