Target
Sigma non-opioid intracellular receptor 1
Ligand
BDBM50067013
Substrate
Meas. Tech.
ChEMBL_792210 (CHEMBL1930737)
Ki
2.12±n/a nM
Citation
 Ferorelli, SAbate, CPedone, MPColabufo, NAContino, MPerrone, RBerardi, F Synthesis and binding assays of novel 3,3-dimethylpiperidine derivatives with various lipophilicities ass¿? receptor ligands. Bioorg Med Chem 19:7612-22 (2011)  
Target
Name:
Sigma non-opioid intracellular receptor 1
Synonyms:
OPRS1 SIGMAR1 Sigma non-opioid intracellular receptor 1 Sigma1-receptor Sterol isomerase-like protein
Type:
Protein
Mol. Mass.:
25307.17
Organism:
Cavia porcellus (Guinea pig)
Description:
Q60492
Residue:
223
  
Inhibitor
Name:
BDBM50067013
Synonyms:
1-[4-(5-Methoxy-1,2,3,4-tetrahydro-naphthalen-1-yl)-butyl]-3,3-dimethyl-piperidine | CHEMBL128358
Type:
Small organic molecule
Emp. Form.:
C22H35NO
Mol. Mass.:
329.5194
SMILES:
COc1cccc2C(CCCCN3CCCC(C)(C)C3)CCCc12
: