Target
Dihydroorotate dehydrogenase (quinone), mitochondrial
Ligand
BDBM50359697
Substrate
Meas. Tech.
ChEMBL_792217 (CHEMBL1930744)
IC50
31±n/a nM
Citation
 Erra, MMoreno, ISanahuja, JAndrés, MReinoso, RFLozoya, EPizcueta, PGodessart, NCastro-Palomino, JC Biaryl analogues of teriflunomide as potent DHODH inhibitors. Bioorg Med Chem Lett 21:7268-72 (2011)  
Target
Name:
Dihydroorotate dehydrogenase (quinone), mitochondrial
Synonyms:
DHODH Dihydroorotate dehydrogenase Dihydroorotate dehydrogenase, mitochondrial Dihydroorotate oxidase (DHODH) | PYRD_HUMAN
Type:
Enzyme
Mol. Mass.:
42881.33
Organism:
Homo sapiens (Human)
Description:
Q02127
Residue:
395
  
Inhibitor
Name:
BDBM50359697
Synonyms:
CHEMBL1929441
Type:
Small organic molecule
Emp. Form.:
C20H16F2N2O4
Mol. Mass.:
386.3488
SMILES:
CCC(=O)C(C#N)C(=O)Nc1ccc(c(c1)C(=O)OC)-c1ccc(F)cc1F
: