Target
Macrophage migration inhibitory factor
Ligand
BDBM50359714
Substrate
Meas. Tech.
ChEMBL_791791 (CHEMBL1931369)
IC50
7300±n/a nM
Citation
 Alam, APal, CGoyal, MKundu, MKKumar, RIqbal, MSDey, SBindu, SSarkar, SPal, UMaiti, NCAdhikari, SBandyopadhyay, U Synthesis and bio-evaluation of human macrophage migration inhibitory factor inhibitor to develop anti-inflammatory agent. Bioorg Med Chem 19:7365-73 (2011)  
Target
Name:
Macrophage migration inhibitory factor
Synonyms:
GIF Glycosylation-inhibiting factor L-dopachrome tautomerase MIF/CD74 (Macrophage migration inhibitory factor and HLA-DR antigens-associated invariant chain) MMIF Macrophage migration inhibitory factor (MIF) | Phenylpyruvate tautomerase
Type:
Enzyme
Mol. Mass.:
12478.18
Organism:
Homo sapiens (Human)
Description:
P14174
Residue:
115
  
Inhibitor
Name:
BDBM50359714
Synonyms:
CHEMBL1927069
Type:
Small organic molecule
Emp. Form.:
C18H17NO5
Mol. Mass.:
327.3313
SMILES:
COc1cc(ccc1O)C1=NOC(COc2ccc(C=O)cc2)C1
: