Target
Alpha-1A adrenergic receptor
Ligand
BDBM50359763
Substrate
Meas. Tech.
ChEMBL_791620 (CHEMBL1930844)
Ki
0.97±n/a nM
Citation
 Huber, DLöber, SHübner, HGmeiner, P Bivalent molecular probes for dopamine D2-like receptors. Bioorg Med Chem 20:455-66 (2011)  
Target
Name:
Alpha-1A adrenergic receptor
Synonyms:
Uncharacterized protein
Type:
PROTEIN
Mol. Mass.:
51698.80
Organism:
Sus scrofa
Description:
ChEMBL_791620
Residue:
466
  
Inhibitor
Name:
BDBM50359763
Synonyms:
CHEMBL1928122
Type:
Small organic molecule
Emp. Form.:
C52H72N6O9
Mol. Mass.:
925.1629
SMILES:
COc1ccccc1N1CCN(CCCCNC(=O)c2cccc(OCCOCCOCCOCCOc3cccc(c3)C(=O)NCCCCN3CCN(CC3)c3ccccc3OC)c2)CC1
: