Target
Serine/threonine-protein kinase Chk1
Ligand
BDBM50359802
Substrate
Meas. Tech.
ChEMBL_791990 (CHEMBL1930050)
IC50
3200±n/a nM
Citation
 Reader, JCMatthews, TPKlair, SCheung, KMScanlon, JProisy, NAddison, GEllard, JPiton, NTaylor, SCherry, MFisher, MBoxall, KBurns, SWalton, MIWestwood, IMHayes, AEve, PValenti, Mde Haven Brandon, ABox, Gvan Montfort, RLWilliams, DHAherne, GWRaynaud, FIEccles, SAGarrett, MDCollins, I Structure-guided evolution of potent and selective CHK1 inhibitors through scaffold morphing. J Med Chem 54:8328-42 (2011)  
Target
Name:
Serine/threonine-protein kinase Chk1
Synonyms:
CHEK1 CHK1 checkpoint homolog Checkpoint kinase-1 (CHK1)
Type:
Enzyme Catalytic Domain
Mol. Mass.:
54443.02
Organism:
Homo sapiens (Human)
Description:
gi_166295192
Residue:
476
  
Inhibitor
Name:
BDBM50359802
Synonyms:
CHEMBL1928676
Type:
Small organic molecule
Emp. Form.:
C15H17N5O
Mol. Mass.:
283.3284
SMILES:
NC[C@H]1CN(CCO1)c1ncnc2[nH]c3ccccc3c12
: