Target
Casein kinase II subunit alpha'
Ligand
BDBM50359846
Substrate
Meas. Tech.
ChEMBL_792164 (CHEMBL1930611)
Ki
66±n/a nM
Citation
 Janeczko, MOrzeszko, AKazimierczuk, ZSzyszka, RBaier, A CK2a and CK2a' subunits differ in their sensitivity to 4,5,6,7-tetrabromo- and 4,5,6,7-tetraiodo-1H-benzimidazole derivatives. Eur J Med Chem 47:345-50 (2012)  
Target
Name:
Casein kinase II subunit alpha'
Synonyms:
CK2A2 CSNK2A2 Casein kinase II alpha' Casein kinase II subunit alpha (CSNK2A2)
Type:
Protein
Mol. Mass.:
41223.82
Organism:
Homo sapiens (Human)
Description:
Residue:
350
  
Inhibitor
Name:
BDBM50359846
Synonyms:
CHEMBL1233807
Type:
Small organic molecule
Emp. Form.:
C11H9Br4N3O2
Mol. Mass.:
534.824
SMILES:
CN(C)c1nc2c(Br)c(Br)c(Br)c(Br)c2n1CC(O)=O
: