Target
Prostaglandin G/H synthase 1
Ligand
BDBM50359903
Substrate
Meas. Tech.
ChEMBL_791244 (CHEMBL1929731)
IC50
>200000±n/a nM
Citation
 Eleftheriou, PGeronikaki, AHadjipavlou-Litina, DVicini, PFilz, OFilimonov, DPoroikov, VChaudhaery, SSRoy, KKSaxena, AK Fragment-based design, docking, synthesis, biological evaluation and structure-activity relationships of 2-benzo/benzisothiazolimino-5-aryliden-4-thiazolidinones as cycloxygenase/lipoxygenase inhibitors. Eur J Med Chem 47:111-24 (2012)  
Target
Name:
Prostaglandin G/H synthase 1
Synonyms:
COX1 Cyclooxygenase-1 (COX-1) PTGS1 | Prostaglandin G/H synthase (cyclooxygenase)
Type:
Protein
Mol. Mass.:
68868.60
Organism:
Ovis aries (Sheep)
Description:
Residue:
600
  
Inhibitor
Name:
BDBM50359903
Synonyms:
CHEMBL409502
Type:
Small organic molecule
Emp. Form.:
C17H11N3OS2
Mol. Mass.:
337.419
SMILES:
O=C1N\C(S\C1=C/c1ccccc1)=N\c1nsc2ccccc12
: