Target
Seed linoleate 13S-lipoxygenase-1
Ligand
BDBM50359902
Substrate
Meas. Tech.
ChEMBL_791246 (CHEMBL1929733)
IC50
100000±n/a nM
Citation
 Eleftheriou, PGeronikaki, AHadjipavlou-Litina, DVicini, PFilz, OFilimonov, DPoroikov, VChaudhaery, SSRoy, KKSaxena, AK Fragment-based design, docking, synthesis, biological evaluation and structure-activity relationships of 2-benzo/benzisothiazolimino-5-aryliden-4-thiazolidinones as cycloxygenase/lipoxygenase inhibitors. Eur J Med Chem 47:111-24 (2012)  
Target
Name:
Seed linoleate 13S-lipoxygenase-1
Synonyms:
15-LOX 15-lipo-oxygenase (SLO) L-1 LOX1.1 Lipoxygenase (LOX) Lipoxygenase-1 | Seed lipoxygenase-1
Type:
Enzyme
Mol. Mass.:
94365.66
Organism:
Glycine max (soybean)
Description:
Residue:
839
  
Inhibitor
Name:
BDBM50359902
Synonyms:
CHEMBL1926826
Type:
Small organic molecule
Emp. Form.:
C19H15N3O4S2
Mol. Mass.:
413.47
SMILES:
COc1cc(\C=C2/S\C(NC2=O)=N\c2nsc3ccccc23)cc(OC)c1O
: