Target
Seed linoleate 13S-lipoxygenase-1
Ligand
BDBM24518
Substrate
Meas. Tech.
ChEMBL_791246 (CHEMBL1929733)
IC50
89100±n/a nM
Citation
 Eleftheriou, PGeronikaki, AHadjipavlou-Litina, DVicini, PFilz, OFilimonov, DPoroikov, VChaudhaery, SSRoy, KKSaxena, AK Fragment-based design, docking, synthesis, biological evaluation and structure-activity relationships of 2-benzo/benzisothiazolimino-5-aryliden-4-thiazolidinones as cycloxygenase/lipoxygenase inhibitors. Eur J Med Chem 47:111-24 (2012)  
Target
Name:
Seed linoleate 13S-lipoxygenase-1
Synonyms:
15-LOX 15-lipo-oxygenase (SLO) L-1 LOX1.1 Lipoxygenase (LOX) Lipoxygenase-1 | Seed lipoxygenase-1
Type:
Enzyme
Mol. Mass.:
94365.66
Organism:
Glycine max (soybean)
Description:
Residue:
839
  
Inhibitor
Name:
BDBM24518
Synonyms:
(2E,5E)-5-[(3-nitrophenyl)methylidene]-2-(1,3-thiazol-2-ylimino)-1,3-thiazolidin-4-one | Thiazole analogue, 5
Type:
Small organic molecule
Emp. Form.:
C13H8N4O3S2
Mol. Mass.:
332.358
SMILES:
[O-][N+](=O)c1cccc(\C=C2\S\C(NC2=O)=N\c2nccs2)c1
: