Target
Protoporphyrinogen oxidase
Ligand
BDBM50359908
Substrate
Meas. Tech.
ChEMBL_791250 (CHEMBL1929737)
Ki
34400±n/a nM
Citation
 Zuo, YYang, SGJiang, LLHao, GFWang, ZFWu, QYXi, ZYang, GF Quantitative structure-activity relationships of 1,3,4-thiadiazol-2(3H)-ones and 1,3,4-oxadiazol-2(3H)-ones as human protoporphyrinogen oxidase inhibitors. Bioorg Med Chem 20:296-304 (2011)  
Target
Name:
Protoporphyrinogen oxidase
Synonyms:
PPO PPOX_HUMAN
Type:
PROTEIN
Mol. Mass.:
50774.78
Organism:
Homo sapiens (Human)
Description:
ChEMBL_791250
Residue:
477
  
Inhibitor
Name:
BDBM50359908
Synonyms:
CHEMBL1926848
Type:
Small organic molecule
Emp. Form.:
C19H22ClN3O3S3
Mol. Mass.:
472.044
SMILES:
CCOC(=O)C(C)(C)Sc1nc2cc(c(Cl)cc2s1)-n1nc(sc1=O)C(C)(C)C
: