Target
Protoporphyrinogen oxidase
Ligand
BDBM50359911
Substrate
Meas. Tech.
ChEMBL_791250 (CHEMBL1929737)
Ki
21400±n/a nM
Citation
 Zuo, YYang, SGJiang, LLHao, GFWang, ZFWu, QYXi, ZYang, GF Quantitative structure-activity relationships of 1,3,4-thiadiazol-2(3H)-ones and 1,3,4-oxadiazol-2(3H)-ones as human protoporphyrinogen oxidase inhibitors. Bioorg Med Chem 20:296-304 (2011)  
Target
Name:
Protoporphyrinogen oxidase
Synonyms:
PPO PPOX_HUMAN
Type:
PROTEIN
Mol. Mass.:
50774.78
Organism:
Homo sapiens (Human)
Description:
ChEMBL_791250
Residue:
477
  
Inhibitor
Name:
BDBM50359911
Synonyms:
CHEMBL1926850
Type:
Small organic molecule
Emp. Form.:
C16H14ClN3OS3
Mol. Mass.:
395.95
SMILES:
CC(C)(C)c1nn(-c2cc3nc(SCC#C)sc3cc2Cl)c(=O)s1
: