Target
5-hydroxytryptamine receptor 2A
Ligand
BDBM50359961
Substrate
Meas. Tech.
ChEMBL_791367 (CHEMBL1930138)
Ki
0.000778±n/a nM
Citation
 Fiorino, FSeverino, BMagli, EPerissutti, EFrecentese, FEsposito, AIncisivo, GMCiano, AMassarelli, PNencini, CSantagada, VCaliendo, G New potent 5-HT(2A) receptor ligands containing an N'-cyanopicolinamidine nucleus: Synthesis and in vitro pharmacological evaluation. Eur J Med Chem 47:520-9 (2012)  
Target
Name:
5-hydroxytryptamine receptor 2A
Synonyms:
5-HT-2A 5-HT2A 5-hydroxytryptamine receptor 2A (5HT2A) Htr2 Serotonin Receptor 2A
Type:
G Protein-Coupled Receptor (GPCR)
Mol. Mass.:
52852.05
Organism:
Rattus norvegicus (rat)
Description:
Rat cortex membranes 5-HT2A receptors.
Residue:
471
  
Inhibitor
Name:
BDBM50359961
Synonyms:
CHEMBL1927095
Type:
Small organic molecule
Emp. Form.:
C21H23F3N6
Mol. Mass.:
416.4427
SMILES:
FC(F)(F)c1cccc(c1)N1CCN(CCCN=C(NC#N)c2ccccn2)CC1
: