Target
Phosphatidylinositol 4,5-bisphosphate 3-kinase catalytic subunit alpha isoform
Ligand
BDBM50360063
Substrate
Meas. Tech.
ChEMBL_793747 (CHEMBL1932608)
IC50
1.3±n/a nM
Citation
 Kendall, JDGiddens, ACTsang, KYFrédérick, RMarshall, ESSingh, RLill, CLLee, WJKolekar, SChao, MMalik, AYu, SChaussade, CBuchanan, CRewcastle, GWBaguley, BCFlanagan, JUJamieson, SMDenny, WAShepherd, PR Novel pyrazolo[1,5-a]pyridines as p110a-selective PI3 kinase inhibitors: Exploring the benzenesulfonohydrazide SAR. Bioorg Med Chem 20:58-68 (2011)  
Target
Name:
Phosphatidylinositol 4,5-bisphosphate 3-kinase catalytic subunit alpha isoform
Synonyms:
P42336 PI3-kinase subunit p110-alpha PIK3CA Phosphatidylinositol 3-kinase alpha (PI3Kalpha) Phosphatidylinositol 4,5-bisphosphate 3-kinase (PI3K) Phosphatidylinositol 4,5-bisphosphate 3-kinase catalytic subunit alpha (PI3Kalpha) Phosphatidylinositol 4,5-bisphosphate 3-kinase catalytic subunit alpha isoform (PI3-Ka) Phosphatidylinositol 4,5-bisphosphate 3-kinase catalytic subunit alpha isoform (PI3K p110alpha) Phosphatidylinositol 4,5-bisphosphate 3-kinase catalytic subunit alpha isoform (PI3K-alpha) Phosphatidylinositol 4,5-bisphosphate 3-kinase catalytic subunit alpha isoform (PI3Kalpha p110alpha) Phosphatidylinositol 4,5-bisphosphate 3-kinase catalytic subunit alpha isoform (PIK3CA) Phosphatidylinositol-4,5-bisphosphate 3-kinase catalytic subunit alpha isoform Phosphoinositide 3-Kinase (PI3K), alpha Chain A Phosphoinositide 3-kinases (PI3K) PtdIns-3-kinase p110 | p110 alpha
Type:
Enzyme Subunit
Mol. Mass.:
124294.87
Organism:
Homo sapiens (Human)
Description:
P42336
Residue:
1068
  
Inhibitor
Name:
BDBM50360063
Synonyms:
CHEMBL1928561
Type:
Small organic molecule
Emp. Form.:
C18H16N6O5S
Mol. Mass.:
428.422
SMILES:
Cc1ccc(cc1S(=O)(=O)N(CCO)\N=C\c1cnn2ccc(cc12)C#N)[N+]([O-])=O
: