Target
Hypoxanthine-guanine phosphoribosyltransferase
Ligand
BDBM50360118
Substrate
Meas. Tech.
ChEMBL_793806 (CHEMBL1932721)
Ki
77000±n/a nM
Citation
 Cesnek, MHocková, DHolý, ADracínský, MBaszczynski, OJersey, JdKeough, DTGuddat, LW Synthesis of 9-phosphonoalkyl and 9-phosphonoalkoxyalkyl purines: evaluation of their ability to act as inhibitors of Plasmodium falciparum, Plasmodium vivax and human hypoxanthine-guanine-(xanthine) phosphoribosyltransferases. Bioorg Med Chem 20:1076-89 (2012)  
Target
Name:
Hypoxanthine-guanine phosphoribosyltransferase
Synonyms:
HGPRT HPRT HPRT_HUMAN Hypoxanthine-guanine phosphoribosyltransferase (HGPRT)
Type:
Protein
Mol. Mass.:
24579.61
Organism:
Homo sapiens (Human)
Description:
P00492
Residue:
218
  
Inhibitor
Name:
BDBM50360118
Synonyms:
CHEMBL1928785
Type:
Small organic molecule
Emp. Form.:
C11H17N4O4P
Mol. Mass.:
300.2508
SMILES:
OP(O)(=O)CCCCCCn1cnc2c1nc[nH]c2=O
: