Target
Prostaglandin E2 receptor EP3 subtype
Ligand
BDBM50360158
Substrate
Meas. Tech.
ChEMBL_793559 (CHEMBL1932310)
Ki
980±n/a nM
Citation
 Kambe, TMaruyama, TNagase, TOgawa, SMinamoto, CSakata, KMaruyama, TNakai, HToda, M Synthesis and evaluation of novel modified¿-lactam prostanoids as EP4 subtype-selective agonists. Bioorg Med Chem 20:702-13 (2012)  
Target
Name:
Prostaglandin E2 receptor EP3 subtype
Synonyms:
PE2R3_MOUSE Prostaglandin E2 receptor EP3 isoform alpha Prostanoid EP3 receptor Ptgerep3
Type:
G-protein coupled receptor
Mol. Mass.:
40092.50
Organism:
Mus musculus (Mouse)
Description:
Residue:
365
  
Inhibitor
Name:
BDBM50360158
Synonyms:
CHEMBL1929551
Type:
Small organic molecule
Emp. Form.:
C21H29NO3S2
Mol. Mass.:
407.59
SMILES:
Cc1cccc(C[C@H](O)\C=C\[C@H]2CCC(=S)N2CCSCCCC(O)=O)c1
: