Target
Prostaglandin E2 receptor EP4 subtype
Ligand
BDBM50360170
Substrate
Meas. Tech.
ChEMBL_793560 (CHEMBL1932311)
Ki
29±n/a nM
Citation
 Kambe, TMaruyama, TNagase, TOgawa, SMinamoto, CSakata, KMaruyama, TNakai, HToda, M Synthesis and evaluation of novel modified¿-lactam prostanoids as EP4 subtype-selective agonists. Bioorg Med Chem 20:702-13 (2012)  
Target
Name:
Prostaglandin E2 receptor EP4 subtype
Synonyms:
PE2R4_MOUSE Prostanoid EP4 receptor Ptgerep4
Type:
G-protein coupled receptor
Mol. Mass.:
56175.66
Organism:
Mus musculus (Mouse)
Description:
Residue:
513
  
Inhibitor
Name:
BDBM50360170
Synonyms:
CHEMBL1929537
Type:
Small organic molecule
Emp. Form.:
C20H24F3NO6S
Mol. Mass.:
463.468
SMILES:
O[C@@H](Cc1cccc(OC(F)(F)F)c1)\C=C\[C@H]1COC(=O)N1CCSCCCC(O)=O
: