Target
Prostaglandin E2 receptor EP4 subtype
Ligand
BDBM50360154
Substrate
Meas. Tech.
ChEMBL_793560 (CHEMBL1932311)
Ki
0.4±n/a nM
Citation
 Kambe, TMaruyama, TNagase, TOgawa, SMinamoto, CSakata, KMaruyama, TNakai, HToda, M Synthesis and evaluation of novel modified¿-lactam prostanoids as EP4 subtype-selective agonists. Bioorg Med Chem 20:702-13 (2012)  
Target
Name:
Prostaglandin E2 receptor EP4 subtype
Synonyms:
PE2R4_MOUSE Prostanoid EP4 receptor Ptgerep4
Type:
G-protein coupled receptor
Mol. Mass.:
56175.66
Organism:
Mus musculus (Mouse)
Description:
Residue:
513
  
Inhibitor
Name:
BDBM50360154
Synonyms:
CHEMBL1929547
Type:
Small organic molecule
Emp. Form.:
C24H35NO3S
Mol. Mass.:
417.605
SMILES:
CCCc1cccc(C[C@H](O)\C=C\[C@H]2CCC(=S)N2CCCCCCC(O)=O)c1
: