Target
Prostaglandin E2 receptor EP2 subtype
Ligand
BDBM50360153
Substrate
Meas. Tech.
ChEMBL_793558 (CHEMBL1932309)
Ki
1100±n/a nM
Citation
 Kambe, TMaruyama, TNagase, TOgawa, SMinamoto, CSakata, KMaruyama, TNakai, HToda, M Synthesis and evaluation of novel modified¿-lactam prostanoids as EP4 subtype-selective agonists. Bioorg Med Chem 20:702-13 (2012)  
Target
Name:
Prostaglandin E2 receptor EP2 subtype
Synonyms:
PE2R2_MOUSE Prostaglandin E2 Prostanoid EP2 receptor Ptgerep2
Type:
G-protein coupled receptor
Mol. Mass.:
40495.26
Organism:
Mus musculus (Mouse)
Description:
Residue:
362
  
Inhibitor
Name:
BDBM50360153
Synonyms:
CHEMBL1929546
Type:
Small organic molecule
Emp. Form.:
C23H33NO3S
Mol. Mass.:
403.578
SMILES:
CCc1cccc(C[C@H](O)\C=C\[C@H]2CCC(=S)N2CCCCCCC(O)=O)c1
: