Target
Dual specificity protein kinase CLK1
Ligand
BDBM50360301
Substrate
Meas. Tech.
ChEMBL_795819 (CHEMBL1937080)
IC50
512±n/a nM
Citation
 Kirrane, TMBoyer, SJBurke, JGuo, XSnow, RJSoleymanzadeh, LSwinamer, AZhang, YMadwed, JBKashem, MKugler, SO'Neill, MM Indole RSK inhibitors. Part 2: optimization of cell potency and kinase selectivity. Bioorg Med Chem Lett 22:738-42 (2011)  
Target
Name:
Dual specificity protein kinase CLK1
Synonyms:
CDC-like kinase 1 CDC2-like kinase 1 (CLK1) CLK1 Dual specificity protein kinase CLK1 Dual specificty protein kinase CLK1
Type:
Protein
Mol. Mass.:
57322.21
Organism:
Homo sapiens (Human)
Description:
P49759
Residue:
484
  
Inhibitor
Name:
BDBM50360301
Synonyms:
CHEMBL1933288 | US9150577, 93
Type:
Small organic molecule
Emp. Form.:
C26H30N6O2
Mol. Mass.:
458.5554
SMILES:
C[C@@H]1CCNC(=O)c2cc3ccc(cc3n12)C(=O)Nc1nc2ccccc2n1CCCN(C)C
: