Target
Receptor-type tyrosine-protein kinase FLT3
Ligand
BDBM50360301
Substrate
Meas. Tech.
ChEMBL_795823 (CHEMBL1937084)
IC50
714±n/a nM
Citation
 Kirrane, TMBoyer, SJBurke, JGuo, XSnow, RJSoleymanzadeh, LSwinamer, AZhang, YMadwed, JBKashem, MKugler, SO'Neill, MM Indole RSK inhibitors. Part 2: optimization of cell potency and kinase selectivity. Bioorg Med Chem Lett 22:738-42 (2011)  
Target
Name:
Receptor-type tyrosine-protein kinase FLT3
Synonyms:
CD135 FL cytokine receptor FLK2 FLT3 Fetal liver kinase-2 Fms-like tyrosine kinase 3 (Flt-3) STK-1 Stem cell tyrosine kinase 1
Type:
Enzyme
Mol. Mass.:
112888.62
Organism:
Homo sapiens (Human)
Description:
P36888
Residue:
993
  
Inhibitor
Name:
BDBM50360301
Synonyms:
CHEMBL1933288 | US9150577, 93
Type:
Small organic molecule
Emp. Form.:
C26H30N6O2
Mol. Mass.:
458.5554
SMILES:
C[C@@H]1CCNC(=O)c2cc3ccc(cc3n12)C(=O)Nc1nc2ccccc2n1CCCN(C)C
: