Target
B1 bradykinin receptor
Ligand
BDBM50360420
Substrate
Meas. Tech.
ChEMBL_796432 (CHEMBL1937747)
IC50
248±n/a nM
Citation
 Bryan, MCBiswas, KPeterkin, TARzasa, RMArik, LLehto, SGSun, HHsieh, FYXu, CFremeau, RTAllen, JR Chromenones as potent bradykinin B1 antagonists. Bioorg Med Chem Lett 22:619-22 (2011)  
Target
Name:
B1 bradykinin receptor
Synonyms:
BDKRB1 Bradykinin B1 receptor
Type:
PROTEIN
Mol. Mass.:
39519.62
Organism:
Oryctolagus cuniculus
Description:
ChEMBL_796432
Residue:
352
  
Inhibitor
Name:
BDBM50360420
Synonyms:
CHEMBL1934254
Type:
Small organic molecule
Emp. Form.:
C32H31ClN2O3
Mol. Mass.:
527.053
SMILES:
Clc1cccc2occ(-c3cccc(c3)C(=O)N[C@@H]3CCCc4cc(CN5CCCCC5)ccc34)c(=O)c12
: