Target
Androgen receptor
Ligand
BDBM50360433
Substrate
Meas. Tech.
ChEMBL_796524 (CHEMBL1937839)
IC50
130±n/a nM
Citation
 Yamamoto, SMatsunaga, NHitaka, TYamada, MHara, TMiyazaki, JSantou, TKusaka, MYamaoka, MKanzaki, NFuruya, STasaka, AHamamura, KIto, M Design, synthesis, and biological evaluation of 4-phenylpyrrole derivatives as novel androgen receptor antagonists. Bioorg Med Chem 20:422-34 (2011)  
Target
Name:
Androgen receptor
Synonyms:
ANDR_HUMAN Androgen Receptor Androgen receptor/Baculoviral IAP repeat-containing protein 2 Dihydrotestosterone receptor Nuclear receptor subfamily 3 group C member 4
Type:
Receptor
Mol. Mass.:
99185.27
Organism:
Homo sapiens (Human)
Description:
CHO cells were stably transfected with human AR gene.
Residue:
920
  
Inhibitor
Name:
BDBM50360433
Synonyms:
CHEMBL1934433
Type:
Small organic molecule
Emp. Form.:
C21H20N2O6S
Mol. Mass.:
428.458
SMILES:
CCOC(=O)c1c(C)n(c(C)c1-c1ccc(cc1)[N+]([O-])=O)S(=O)(=O)c1ccccc1
: