Target
Glucagon receptor
Ligand
BDBM50360601
Substrate
Meas. Tech.
ChEMBL_795440 (CHEMBL1937445)
Ki
70±n/a nM
Citation
 Filipski, KJBian, JEbner, DCLee, ECLi, JCSammons, MFWright, SWStevens, BDDidiuk, MTTu, MPerreault, CBrown, JAtkinson, KTan, BSalatto, CTLitchfield, JPfefferkorn, JAGuzman-Perez, A A novel series of glucagon receptor antagonists with reduced molecular weight and lipophilicity. Bioorg Med Chem Lett 22:415-20 (2011)  
Target
Name:
Glucagon receptor
Synonyms:
GCGR GLR_HUMAN Glucagon receptor (GlucR)
Type:
Enzyme
Mol. Mass.:
54026.92
Organism:
Homo sapiens (Human)
Description:
P47871
Residue:
477
  
Inhibitor
Name:
BDBM50360601
Synonyms:
CHEMBL1933349 | MK-0893
Type:
Small organic molecule
Emp. Form.:
C32H27Cl2N3O4
Mol. Mass.:
588.48
SMILES:
COc1ccc2cc(ccc2c1)-c1cc(nn1[C@@H](C)c1ccc(cc1)C(=O)NCCC(O)=O)-c1cc(Cl)cc(Cl)c1
: