Target
Prostaglandin E2 receptor EP2 subtype
Ligand
BDBM50360629
Substrate
Meas. Tech.
ChEMBL_795667 (CHEMBL1936148)
Ki
19±n/a nM
Citation
 Kambe, TMaruyama, TNakano, MNakai, YYoshida, TMatsunaga, NOida, HKonaka, AMaruyama, TNakai, HToda, M Discovery of a novel EP2/EP4 dual agonist with high subtype-selectivity. Bioorg Med Chem Lett 22:396-401 (2011)  
Target
Name:
Prostaglandin E2 receptor EP2 subtype
Synonyms:
PE2R2_MOUSE Prostaglandin E2 Prostanoid EP2 receptor Ptgerep2
Type:
G-protein coupled receptor
Mol. Mass.:
40495.26
Organism:
Mus musculus (Mouse)
Description:
Residue:
362
  
Inhibitor
Name:
BDBM50360629
Synonyms:
CHEMBL1933725
Type:
Small organic molecule
Emp. Form.:
C20H22N2O4S2
Mol. Mass.:
418.53
SMILES:
O[C@@H](Cc1ccccc1)\C=C\[C@H]1CCC(=O)N1CCSc1nc(cs1)C(O)=O
: