Target
Proto-oncogene tyrosine-protein kinase Src
Ligand
BDBM50360658
Substrate
Meas. Tech.
ChEMBL_795748 (CHEMBL1936377)
IC50
>150000±n/a nM
Citation
 Rao, VKChhikara, BSTiwari, RShirazi, ANParang, KKumar, A One-pot regioselective synthesis of tetrahydroindazolones and evaluation of their antiproliferative and Src kinase inhibitory activities. Bioorg Med Chem Lett 22:410-4 (2011)  
Target
Name:
Proto-oncogene tyrosine-protein kinase Src
Synonyms:
Calmodulin/Proto-oncogene tyrosine-protein kinase Src Proto-oncogene c-Src SRC SRC_HUMAN V-src sarcoma (Schmidt-Ruppin A-2) viral oncogene homolog (avian) p60-Src | pp60c-src
Type:
Protein
Mol. Mass.:
59838.60
Organism:
Homo sapiens (Human)
Description:
P12931
Residue:
536
  
Inhibitor
Name:
BDBM50360658
Synonyms:
CHEMBL1933753
Type:
Small organic molecule
Emp. Form.:
C19H21ClN2O3
Mol. Mass.:
360.835
SMILES:
CC1(C)Oc2nn(c(C3CCCCC3)c2C(=O)O1)-c1ccc(Cl)cc1
: