Target
Histamine H3 receptor
Ligand
BDBM50360904
Substrate
Meas. Tech.
ChEMBL_795469 (CHEMBL1937474)
Ki
42±n/a nM
Citation
 Hudkins, RLAimone, LDDandu, RRDunn, DGruner, JAHuang, ZJosef, KALyons, JAMathiasen, JRTao, MZulli, ALRaddatz, R 4,5-dihydropyridazin-3-one derivatives as histamine H3 receptor inverse agonists. Bioorg Med Chem Lett 22:194-8 (2011)  
Target
Name:
Histamine H3 receptor
Synonyms:
HH3R Hrh3
Type:
G Protein-Coupled Receptor (GPCR)
Mol. Mass.:
48607.98
Organism:
Rattus norvegicus (rat)
Description:
Residue:
445
  
Inhibitor
Name:
BDBM50360904
Synonyms:
CHEMBL1935116
Type:
Small organic molecule
Emp. Form.:
C23H28N4O2
Mol. Mass.:
392.494
SMILES:
C[C@@H]1CCCN1CCCOc1ccc(cc1)C1=NNC(=O)C(C1)c1ccccn1
: