Target
Potassium voltage-gated channel subfamily H member 2
Ligand
BDBM50360889
Substrate
Meas. Tech.
ChEMBL_795488 (CHEMBL1937493)
IC50
>10000±n/a nM
Citation
 Hudkins, RLAimone, LDDandu, RRDunn, DGruner, JAHuang, ZJosef, KALyons, JAMathiasen, JRTao, MZulli, ALRaddatz, R 4,5-dihydropyridazin-3-one derivatives as histamine H3 receptor inverse agonists. Bioorg Med Chem Lett 22:194-8 (2011)  
Target
Name:
Potassium voltage-gated channel subfamily H member 2
Synonyms:
1,3-beta-glucan synthase component GLS2 ERG Eag-related protein 1 Ether-a-go-go-related gene (HERG) Ether-a-go-go-related gene potassium channel 1 Ether-a-go-go-related gene potassium channel 1 (hERG1) Ether-a-go-go-related protein 1 H-ERG KCNH2 Potassium voltage-gated channel subfamily H member 2 (hERG) Voltage-gated potassium channel subunit Kv11.1 hERG Potassium Channel 1 | putative potassium channel subunit
Type:
Multi-pass membrane protein
Mol. Mass.:
126672.65
Organism:
Homo sapiens (Human)
Description:
Q12809
Residue:
1159
  
Inhibitor
Name:
BDBM50360889
Synonyms:
CHEMBL1935100
Type:
Small organic molecule
Emp. Form.:
C18H25N3O2
Mol. Mass.:
315.41
SMILES:
C[C@@H]1CCCN1CCCOc1ccc(cc1)C1=NNC(=O)CC1
: