Target
Collagenase 3
Ligand
BDBM50360969
Substrate
Meas. Tech.
ChEMBL_796151 (CHEMBL1937515)
IC50
1980±n/a nM
Citation
 Wu, YLi, JWu, JMorgan, PXu, XRancati, FVallese, SRaveglia, LHotchandani, RFuller, NBard, JCunningham, KFish, SKrykbaev, RTam, SGoldman, SJWilliams, CMansour, TSSaiah, ESypek, JLi, W Discovery of potent and selective matrix metalloprotease 12 inhibitors for the potential treatment of chronic obstructive pulmonary disease (COPD). Bioorg Med Chem Lett 22:138-43 (2011)  
Target
Name:
Collagenase 3
Synonyms:
MMP-13 MMP13_HUMAN Matrix metalloproteinase-13 (MMP-13) | Matrix metalloproteinase-13 (MMP13)
Type:
Enzyme
Mol. Mass.:
53808.06
Organism:
Homo sapiens (Human)
Description:
P45452
Residue:
471
  
Inhibitor
Name:
BDBM50360969
Synonyms:
CHEMBL1935291
Type:
Small organic molecule
Emp. Form.:
C20H18N2O5S2
Mol. Mass.:
430.497
SMILES:
CC(C)[C@H](NS(=O)(=O)c1ccc2c(c1)oc1ccc(cc21)-c1nccs1)C(O)=O
: