Target
Histamine H3 receptor
Ligand
BDBM50360993
Substrate
Meas. Tech.
ChEMBL_795962 (CHEMBL1936234)
Ki
49±n/a nM
Citation
 Becknell, NCDandu, RRLyons, JAAimone, LDRaddatz, RHudkins, RL Synthesis and evaluation of 4-alkoxy-[1'-cyclobutyl-spiro(3,4-dihydrobenzopyran-2,4'-piperidine)] analogues as histamine-3 receptor antagonists. Bioorg Med Chem Lett 22:186-9 (2011)  
Target
Name:
Histamine H3 receptor
Synonyms:
HH3R Hrh3
Type:
G Protein-Coupled Receptor (GPCR)
Mol. Mass.:
48607.98
Organism:
Rattus norvegicus (rat)
Description:
Residue:
445
  
Inhibitor
Name:
BDBM50360993
Synonyms:
CHEMBL1935420
Type:
Small organic molecule
Emp. Form.:
C22H31NO3
Mol. Mass.:
357.4864
SMILES:
C(Oc1ccc2OC3(CCN(CC3)C3CCC3)CCc2c1)C1CCOC1
: