Target
Histamine H3 receptor
Ligand
BDBM50360977
Substrate
Meas. Tech.
ChEMBL_795962 (CHEMBL1936234)
Ki
62±n/a nM
Citation
 Becknell, NCDandu, RRLyons, JAAimone, LDRaddatz, RHudkins, RL Synthesis and evaluation of 4-alkoxy-[1'-cyclobutyl-spiro(3,4-dihydrobenzopyran-2,4'-piperidine)] analogues as histamine-3 receptor antagonists. Bioorg Med Chem Lett 22:186-9 (2011)  
Target
Name:
Histamine H3 receptor
Synonyms:
HH3R Hrh3
Type:
G Protein-Coupled Receptor (GPCR)
Mol. Mass.:
48607.98
Organism:
Rattus norvegicus (rat)
Description:
Residue:
445
  
Inhibitor
Name:
BDBM50360977
Synonyms:
CHEMBL1935422
Type:
Small organic molecule
Emp. Form.:
C22H31NO2S
Mol. Mass.:
373.552
SMILES:
C1CC(C1)N1CCC2(CC1)CCc1cc(OC3CCSCC3)ccc1O2
: