Target
5-hydroxytryptamine receptor 6
Ligand
BDBM50361049
Substrate
Meas. Tech.
ChEMBL_796062 (CHEMBL1936932)
IC50
34±n/a nM
Citation
 Sundar, BGBailey, TRDunn, DDBacon, ERSalvino, JMMorton, GCAimone, LDZeqi, HMathiasen, JRDicamillo, AHuffman, MJMcKenna, BAKopec, KLu, LDBrown, RQian, JAngeles, TConnors, TSpais, CHolskin, BGalinis, DDuzic, ESchaffhauser, HRosse, GC Novel brain penetrant benzofuropiperidine 5-HT6 receptor antagonists. Bioorg Med Chem Lett 22:120-3 (2011)  
Target
Name:
5-hydroxytryptamine receptor 6
Synonyms:
5-HT-6 5-hydroxytryptamine receptor 6 (5-HT-6) 5-hydroxytryptamine receptor 6 (5HT6) HTR6 Serotonin 6 (5-HT6) receptor | Serotonin Receptor 6
Type:
G Protein-Coupled Receptor (GPCR)
Mol. Mass.:
46968.43
Organism:
Homo sapiens (Human)
Description:
P50406
Residue:
440
  
Inhibitor
Name:
BDBM50361049
Synonyms:
CHEMBL1935593
Type:
Small organic molecule
Emp. Form.:
C19H19NO3S
Mol. Mass.:
341.424
SMILES:
CC1(C)NCCc2c1oc1cc(ccc21)S(=O)(=O)c1ccccc1
: