Target
5-hydroxytryptamine receptor 2B
Ligand
BDBM50361053
Substrate
Meas. Tech.
ChEMBL_796328 (CHEMBL1937643)
IC50
1500±n/a nM
Citation
 Sundar, BGBailey, TRDunn, DDBacon, ERSalvino, JMMorton, GCAimone, LDZeqi, HMathiasen, JRDicamillo, AHuffman, MJMcKenna, BAKopec, KLu, LDBrown, RQian, JAngeles, TConnors, TSpais, CHolskin, BGalinis, DDuzic, ESchaffhauser, HRosse, GC Novel brain penetrant benzofuropiperidine 5-HT6 receptor antagonists. Bioorg Med Chem Lett 22:120-3 (2011)  
Target
Name:
5-hydroxytryptamine receptor 2B
Synonyms:
5-HT-2B 5-hydroxytryptamine (serotonin) receptor 2B [Homo sapiens] 5-hydroxytryptamine receptor 2C (5HT2C) HTR2B Serotonin 2b (5-HT2b) receptor | Serotonin Receptor 2B
Type:
G Protein-Coupled Receptor (GPCR)
Mol. Mass.:
54312.47
Organism:
Homo sapiens (Human)
Description:
Receptor binding assays were performed using human clone stably expressed in CHO cells.
Residue:
481
  
Inhibitor
Name:
BDBM50361053
Synonyms:
CHEMBL1935601
Type:
Small organic molecule
Emp. Form.:
C21H20FNO4S
Mol. Mass.:
401.451
SMILES:
Fc1cccc(c1)S(=O)(=O)c1ccc2c3CCNC4(CCCOC4)c3oc2c1
: