Target
Natural resistance-associated macrophage protein 2
Ligand
BDBM50361141
Substrate
Meas. Tech.
ChEMBL_795244 (CHEMBL1936903)
IC50
2820±n/a nM
Citation
 Cadieux, JAZhang, ZMattice, MBrownlie-Cutts, AFu, JRatkay, LGKwan, RThompson, JSanghara, JZhong, JGoldberg, YP Synthesis and biological evaluation of substituted pyrazoles as blockers of divalent metal transporter 1 (DMT1). Bioorg Med Chem Lett 22:90-5 (2011)  
Target
Name:
Natural resistance-associated macrophage protein 2
Synonyms:
DCT1 DMT1 Divalent metal transporter 1 NRAMP 2 SLC11A2
Type:
PROTEIN
Mol. Mass.:
62262.02
Organism:
Homo sapiens (Human)
Description:
ChEMBL_795244
Residue:
568
  
Inhibitor
Name:
BDBM50361141
Synonyms:
CHEMBL1933770
Type:
Small organic molecule
Emp. Form.:
C16H15N3O2
Mol. Mass.:
281.3092
SMILES:
COc1ccc(cc1)-c1c(C)[nH]n(-c2ccccn2)c1=O
: